{"text_format":"1","workbook":"xlsx","n_sheets":9,"sheets":["Input","OdA","Riepilogo_Spec_Tecniche","ReadMe","Offerte_e_Calcoli","Congelam_PC","Config_Dispo","Contatti_Fornitori","Ana"],"not_rendered":{"charts":0,"images":1,"macros":1,"external_links":2,"defined_names":37,"comments":0,"pivot_tables":0},"unopened":[],"bounds":{"document_bytes":16777216,"sheet_cells":100000,"rows_first":2000,"rows_last":500,"rows_between":2000,"halvings":0,"cell_chars":16384,"cell_head_chars":4096},"cells_cut":0,"cells_raw":0,"read":"whole","date_system":"1900"}

{"sheet":"Input","index":0,"n_rows":29,"n_cols":8,"rows_kept":29,"cut":false,"hidden":false,"merged":[[7,7,9,21]]}
[null,"Nome amministrazione (ad es: Comune di Milano) *",null,"Ad es., Comune di Milano"]
[]
[]
[null,"Prodotto principale - Mobile Workstation 15.6'"]
[null,null,"Quantitativo prodotti (>= 10)",null,null,null,null," - L'Amministrazione deve verificare che la versione del configuratore utilizzato è la stessa pubblicata su Acquistinrete PA."]
[null,null,null,null,null,null,null," - In presenza di versioni differenti deve essere necessariamente utilizzato il configuratore aggiornato pubblicato sul portale."]
[null,"Configurazione prescelta",null,null,null,null,null," - Una volta compilati i campi del foglio Input, aprire lo sheet \"ODA\", stampare e firmare il documento da allegare all'ordine."]
[null,null,"RAM (GB)",16,null,null,null," - In caso di anomalie nella visualizzazione della graduatoria, si invita a contattare Consip tramite il Call Center degli Acquisti in Rete della P.A. al numero verde 800 753 783 oppure attraverso la funzione “Filo diretto con il programma” disponibile nell’area riservata del sito https://www.acquistinretepa.it/ accendibile con il profilo di punto istruttore o di punto ordinante."]
[null,null,"SSD (GB)",512]
[null,null,"Sistema Operativo","Distribuzione Linux"]
[null,null,"Scheda grafica discreta","No"]
[]
[null,"Specifiche secondarie"]
[null,null,"Lettore biometrico di impronte digitali integrato","No"]
[null,null,"Webcam Integrata FHD IR","No"]
[null,null,"Dimensione del display (pollici)"]
[null,null,"Lettore di micro-SD card integrato","No"]
[null,null,"Camera shutter","No"]
[null,null,"Possesso di certificazione TCO Generation 9 for notebooks","No"]
[]
[null,"Servizi opzionali"]
[null,null,"Integrazione con il servizio di Trouble Ticketing dell’Amministrazione","No"]
[]
[null,"Prodotti opzionali"]
[null,null,"Docking station / port-replicator","No"]
[null,null,"Set tastiera e mouse wireless","No"]
[null,null,"Cuffie stereo e microfono","No"]
[null,null,"Zaino porta computer","No"]
[null,null,"Monitor multimediale da 27''","No"]

{"sheet":"OdA","index":1,"n_rows":20,"n_cols":6,"rows_kept":20,"cut":false,"hidden":true,"merged":[]}
[]
[null,null,"Nome amministrazione:",{"$f":"+Input!D1","v":"Ad es., Comune di Milano"}]
[]
[]
[null,null,"Fornitore aggiudicatario","Nome prodotto","Prezzo unitario","Importo complessivo ordine"]
[1,null,{"$f":"+Offerte_e_Calcoli!P23","v":"Posdata S.r.l."},{"$f":"+Offerte_e_Calcoli!Q23","v":"Lenovo ThinkPad P16v Gen2 "},{"$f":"+Offerte_e_Calcoli!O23","v":1083.06},{"$f":"+E6*Input!D5","v":0}]
[]
[null,null,"Riferimenti fornitore aggiudicatario"]
[null,null,{"$f":"+VLOOKUP($C$6,Contatti_Fornitori!$B:$E,2,FALSE)","v":"Andrea Calibani"}]
[null,null,{"$f":"+VLOOKUP($C$6,Contatti_Fornitori!$B:$E,3,FALSE)","v":"andrea.calibani@posdata.it"}]
[]
[]
[]
[null,null,"Altri Fornitori NON aggiudicatari","Nome prodotto","Prezzo unitario"]
[null,null,{"$f":"+Offerte_e_Calcoli!P24","v":"Converge S.r.l."},{"$f":"+Offerte_e_Calcoli!Q24","v":"Lenovo ThinkPad P16v Gen2 "},{"$f":"+Offerte_e_Calcoli!O24","v":1409.26}]
[null,null,{"$f":"+Offerte_e_Calcoli!P25","v":"ITM S.r.l."},{"$f":"+Offerte_e_Calcoli!Q25","v":"Dell Pro Max 16"},{"$f":"+Offerte_e_Calcoli!O25","v":1470}]
[null,null,{"$f":"+Offerte_e_Calcoli!P26","v":"Eurome S.r.l."},{"$f":"+Offerte_e_Calcoli!Q26","v":"Dell Pro Max 16"},{"$f":"+Offerte_e_Calcoli!O26","v":1580}]
[null,null,{"$f":"+Offerte_e_Calcoli!P27","v":"RTI Trust Technology Services  S.r.l."},{"$f":"+Offerte_e_Calcoli!Q27","v":"HP ZBook Fury 16 G11"},{"$f":"+Offerte_e_Calcoli!O27","v":1933.65}]
[null,null,{"$f":"+Offerte_e_Calcoli!P28","v":"Bellucci S.p.A."},{"$f":"+Offerte_e_Calcoli!Q28","v":"HP ZBook Fury 16 G11"},{"$f":"+Offerte_e_Calcoli!O28","v":2130}]
[null,null,{"$f":"+Offerte_e_Calcoli!P29","v":""},{"$f":"+Offerte_e_Calcoli!Q29","v":""},{"$f":"+Offerte_e_Calcoli!O29","v":""}]

{"sheet":"Riepilogo_Spec_Tecniche","index":2,"n_rows":20,"n_cols":12,"rows_kept":20,"cut":false,"hidden":true,"merged":[]}
["Operatore Economico",{"$f":"+Offerte_e_Calcoli!E1","v":"Bellucci S.p.A."},{"$f":"+Offerte_e_Calcoli!F1","v":"Bsistemi S.p.A."},{"$f":"+Offerte_e_Calcoli!G1","v":"Converge S.r.l."},{"$f":"+Offerte_e_Calcoli!H1","v":"Eurome S.r.l."},{"$f":"+Offerte_e_Calcoli!I1","v":"ITM S.r.l."},{"$f":"+Offerte_e_Calcoli!J1","v":"Posdata S.r.l."},{"$f":"+Offerte_e_Calcoli!K1","v":"RTI Trust Technology Services  S.r.l."}]
["Prodotto principale"]
["Marca e modello","HP ZBook Fury 16 G11","Dell Mobile Precision Workstation 3591","Lenovo ThinkPad P16v Gen2 ","Dell Pro Max 16","Dell Pro Max 16","Lenovo ThinkPad P16v Gen2 ","HP ZBook Fury 16 G11"]
["Specifiche tecniche primarie"]
["Processore","Intel Core i7-14700HX","Intel Core Ultra 7 165H","Intel Core Ultra 7 155H","Intel Core Ultra 7  255H","Intel Core Ultra 7  255H","Intel Core Ultra 7 165H","Intel Core i7-14700HX"]
["Lettore biometrico integrato","SI","SI","SI","SI","SI","SI","SI"]
["Webcam integrata FHD IR","SI","SI","SI","SI","SI","SI","SI"]
["Lettore di schede (Micro)SD","SI","SI","SI","SI","SI","SI","SI"]
["Camera shutter","SI","SI","SI","SI","SI","SI","SI"]
["Certificazione TCO","SI","SI","SI","SI","SI","SI","SI"]
["Integrazione con il servizio di Trouble Ticketing","SI","SI","SI","SI","NO","SI","SI"]
["Opzioni di prodotto standard"]
["Docking station / Port replicator","HP Thunderbolt G4 Dock","Dell Dock WD19S 180W","Lenovo Thunderbolt 4 Dock","Dell Pro Dock WD25Z","Dell Pro Dock WD25Z","Lenovo Thunderbolt 4 Dock","HP Thunderbolt G4 Dock",null,null,null,{"$f":"+Input!D25","v":"No"}]
["Set mouse e tastiera wireless","HP 435 Mouse + HP 475 Keyboard","Dell Pro KM5221W","Lenovo Essential Wireless Combo Gen 2","Dell Pro KM5221W","Dell Pro KM5221W","Lenovo Essential Wireless Combo Gen 2","HP 435 Mouse + HP 475 Keyboard",null,null,null,{"$f":"+Input!D26","v":"No"}]
["Prodotti opzionali facoltativi"]
["Cuffie stereo e microfono","HP Poly Blackwire 3320","Dell WH3024","JABRA EVOLVE 20","Dell WH3024","Dell WH3024","Lenovo Wired VoIP Headset","HP Poly Blackwire 3320",null,null,null,{"$f":"+Input!D27","v":"No"}]
["Zaino porta computer","Mobilis 111227","Dell EcoLoop CP3724","Lenovo 15.6 Value Plus Backpack","Dell EcoLoop CP3724","Dell EcoLoop CP3724","Lenovo 15.6 Value Plus Backpack","Mobilis 111227",null,null,null,{"$f":"+Input!D28","v":"No"}]
["Monitor multimediale da 27\"","Philps 275S1E","Dell P2723D","LENOVO ThinkVision E27q-40","AOC Q27E3UMF","DELL P2725D","Lenovo ThinkVision E27q-40","PHILIPS 275S1AE/00 ",null,null,null,{"$f":"+Input!D29","v":"No"}]
[]
["Congelamento",{"$f":"+VLOOKUP(B1,Tabella2[],2,FALSE)","v":0},{"$f":"+VLOOKUP(C1,Tabella2[],2,FALSE)","v":1},{"$f":"+VLOOKUP(D1,Tabella2[],2,FALSE)","v":0},{"$f":"+VLOOKUP(E1,Tabella2[],2,FALSE)","v":0},{"$f":"+VLOOKUP(F1,Tabella2[],2,FALSE)","v":0},{"$f":"+VLOOKUP(G1,Tabella2[],2,FALSE)","v":0},{"$f":"+VLOOKUP(H1,Tabella2[],2,FALSE)","v":0}]

{"sheet":"ReadMe","index":3,"n_rows":18,"n_cols":3,"rows_kept":18,"cut":false,"hidden":true,"merged":[]}
[]
[null,"Congelamento prodotto"]
[null,null,"Nel foglio Congelam_PC\n- Selezionare il prodotto da congelare\n- Inserire un 1 nella colonna C della riga selezionata"]
[]
[null,"Modifica specifiche tecniche prodotto esistente"]
[null,null,"Nel foglio Offerte_e_Calcoli\n- Selezionare la colonna corrispondente al prodotto da modificare (da E ad K)\n- Modificare il valore corrispondente alla riga riguardante la/le specifica/che da modificare (dalla riga 5 alla riga 30)\n\nNel foglio Riepilogo_Spec_Tecniche\n- Selezionare la colonna corrispondente al prodotto da modificare (da B ad H)\n- Modificare il valore corrispondente alla riga riguardante la/le specifica/che da modificare (dalla riga 3 alla riga 18)"]
[]
[null,"Modifica configurazioni disponibili"]
[null,null,"Nel foglio Config_Dispo\n- Selezionare la riga corrispondente alla configurazione da modificare (da riga 4 a 255)\n- Modificare il valore corrispondente alla colonna della caratteristica da modificare (colonne dalla D alla H)"]
[]
[null,"Eliminazione prodotto esistente"]
[null,null,"Nel foglio Offerte_e_Calcoli\n- Selezionare la colonna corrispondente al prodotto da modificare (da E ad K)\n- Eliminare i valori di quella colonna (solo i valori, non tutta la colonna)"]
[]
[null,"Sostituzione prodotto esistente"]
[null,null,"Come Modifica specifiche tecniche prodotto esistente"]
[]
[null,"Aggiunta nuovo prodotto"]
[null,null,"Nel foglio Offerte_e_Calcoli\n- Selezionare la colonna corrispondente al prodotto da aggiungere (da E ad K) \n- Inserire i valori relativi al nuovo prodotto\n\nNel foglio Config_Dispo\n- Selezionare la riga corrispondente alla configurazione da aggiungere (da riga 4 a 255) \n- Inserire i valori relativi alla nuova configurazione\n\nNel foglio Riepilogo_Spec_Tecniche\n- Selezionare la colonna corrispondente al prodotto da aggiungere (da B ad H) \n- Inserire i valori relativi al nuovo prodotto\n"]

{"sheet":"Offerte_e_Calcoli","index":4,"n_rows":34,"n_cols":20,"rows_kept":34,"cut":false,"hidden":true,"merged":[]}
[null,null,null,null,"Bellucci S.p.A.","Bsistemi S.p.A.","Converge S.r.l.","Eurome S.r.l.","ITM S.r.l.","Posdata S.r.l.","RTI Trust Technology Services  S.r.l.",null,null,{"$f":"+E1","v":"Bellucci S.p.A."},"Bsistemi S.p.A.","Converge S.r.l.","Eurome S.r.l.","ITM S.r.l.","Posdata S.r.l.","RTI Trust Technology Services  S.r.l."]
[]
["Da Input",null,null,null,"Dati tecnici da cataloghi",null,null,null,null,null,null,null,null,"Check specifiche disponibili"]
[]
[{"$f":"+Input!C14","v":"Lettore biometrico di impronte digitali integrato"},{"$f":"+Input!D14","v":"No"},{"$f":"+LEFT(B5,2)","v":"No"},null,"Sì","Sì","Sì","Sì","Sì","Sì","Sì",null,null,{"$f":"IF($C5=\"no\",1,IF($C5=E5,1,0))","v":1},{"$f":"IF($C5=\"no\",1,IF($C5=F5,1,0))","v":1},{"$f":"IF($C5=\"no\",1,IF($C5=G5,1,0))","v":1},{"$f":"IF($C5=\"no\",1,IF($C5=H5,1,0))","v":1},{"$f":"IF($C5=\"no\",1,IF($C5=I5,1,0))","v":1},{"$f":"IF($C5=\"no\",1,IF($C5=J5,1,0))","v":1},{"$f":"IF($C5=\"no\",1,IF($C5=K5,1,0))","v":1}]
[{"$f":"+Input!C15","v":"Webcam Integrata FHD IR"},{"$f":"+Input!D15","v":"No"},{"$f":"+LEFT(B6,2)","v":"No"},null,"Sì","Sì","Sì","Sì","Sì","Sì","Sì",null,null,{"$f":"IF($C6=\"no\",1,IF($C6=E6,1,0))","v":1},1,1,1,1,1,1]
[{"$f":"+Input!C16","v":"Dimensione del display (pollici)"},{"$f":"+Input!D16","v":0},{"$f":"+B7*1","v":0},null,16,15.6,16,16,16,16,16,null,null,{"$f":"IF($C7=0,1,IF($C7=E7,1,0))","v":1},{"$f":"IF($C7=0,1,IF($C7=F7,1,0))","v":1},1,1,1,1,1]
[{"$f":"+Input!C17","v":"Lettore di micro-SD card integrato"},{"$f":"+Input!D17","v":"No"},"No",null,"Sì","Sì","Sì","Sì","Sì","Sì","Sì",null,null,1,1,1,1,1,1,1]
[{"$f":"+Input!C18","v":"Camera shutter"},{"$f":"+Input!D18","v":"No"},"No",null,"Sì","Sì","Sì","Sì","Sì","Sì","Sì",null,null,1,1,1,1,1,1,1]
[{"$f":"+Input!C19","v":"Possesso di certificazione TCO Generation 9 for notebooks"},{"$f":"+Input!D19","v":"No"},{"$f":"+LEFT(B10,2)","v":"No"},null,"Sì","Sì","Sì","Sì","Sì","Sì","Sì",null,null,1,1,1,1,1,1,1]
[{"$f":"+Input!C22","v":"Integrazione con il servizio di Trouble Ticketing dell’Amministrazione"},{"$f":"+Input!D22","v":"No"},"No",null,"Sì","Sì","Sì","Sì","No","Sì","Sì",null,null,1,1,1,1,1,1,1]
[{"$f":"+Input!C25","v":"Docking station / port-replicator"},{"$f":"+Input!D25","v":"No"},{"$f":"+LEFT(B12,5)","v":"No"},null,"Sì","Sì","Sì","Sì","Sì","Sì","Sì",null,null,{"$f":"IF($C12<>\"Sì, d\",1,IF(E12=\"Sì\",1,0))","v":1},{"$f":"IF($C12<>\"Sì, d\",1,IF(F12=\"Sì\",1,0))","v":1},{"$f":"IF($C12<>\"Sì, d\",1,IF(G12=\"Sì\",1,0))","v":1},{"$f":"IF($C12<>\"Sì, d\",1,IF(H12=\"Sì\",1,0))","v":1},{"$f":"IF($C12<>\"Sì, d\",1,IF(I12=\"Sì\",1,0))","v":1},{"$f":"IF($C12<>\"Sì, d\",1,IF(J12=\"Sì\",1,0))","v":1},{"$f":"IF($C12<>\"Sì, d\",1,IF(K12=\"Sì\",1,0))","v":1}]
[{"$f":"+Input!C26","v":"Set tastiera e mouse wireless"},{"$f":"+Input!D26","v":"No"},{"$f":"+LEFT(B13,5)","v":"No"},null,"Sì","Sì","Sì","Sì","Sì","Sì","Sì",null,null,{"$f":"IF($C13<>\"Sì, d\",1,IF(E13=\"Sì\",1,0))","v":1},1,1,1,1,1,1]
[{"$f":"+Input!C29","v":"Monitor multimediale da 27''"},{"$f":"+Input!D29","v":"No"},{"$f":"+LEFT(B14,5)","v":"No"},null,"No","Sì","Sì","No","Sì","Sì","No",null,null,{"$f":"IF($C14<>\"Sì, d\",1,IF(E14=\"Sì\",1,0))","v":1},1,1,1,1,1,1]
[]
[null,null,null,null,null,null,null,null,null,null,null,null,"CHK Specifiche disponibili",{"$f":"IF(COUNTIF(N5:N14,0)=0,1,0)","v":1},1,1,1,1,1,1]
["Da Input",null,null,null,"Offerte economiche da cataloghi",null,null,null,null,null,null,null,"CHK Configuraz disponibili",{"$f":"+VLOOKUP(N1&Config_Dispo!$B$1,Config_Dispo!$B:$I,8,FALSE)","v":1},{"$f":"+VLOOKUP(O1&Config_Dispo!$B$1,Config_Dispo!$B:$I,8,FALSE)","v":1},{"$f":"+VLOOKUP(P1&Config_Dispo!$B$1,Config_Dispo!$B:$I,8,FALSE)","v":1},{"$f":"+VLOOKUP(Q1&Config_Dispo!$B$1,Config_Dispo!$B:$I,8,FALSE)","v":1},{"$f":"+VLOOKUP(R1&Config_Dispo!$B$1,Config_Dispo!$B:$I,8,FALSE)","v":1},{"$f":"+VLOOKUP(S1&Config_Dispo!$B$1,Config_Dispo!$B:$I,8,FALSE)","v":1},{"$f":"+VLOOKUP(T1&Config_Dispo!$B$1,Config_Dispo!$B:$I,8,FALSE)","v":1}]
[null,null,null,null,null,null,null,null,null,null,null,null,"CHK congelamento",{"$f":"IF(VLOOKUP(N1,Tabella2[#All],2,FALSE)=1,0,1)","v":1},{"$f":"IF(VLOOKUP(O1,Tabella2[#All],2,FALSE)=1,0,1)","v":0},{"$f":"IF(VLOOKUP(P1,Tabella2[#All],2,FALSE)=1,0,1)","v":1},{"$f":"IF(VLOOKUP(Q1,Tabella2[#All],2,FALSE)=1,0,1)","v":1},{"$f":"IF(VLOOKUP(R1,Tabella2[#All],2,FALSE)=1,0,1)","v":1},{"$f":"IF(VLOOKUP(S1,Tabella2[#All],2,FALSE)=1,0,1)","v":1},{"$f":"IF(VLOOKUP(T1,Tabella2[#All],2,FALSE)=1,0,1)","v":1}]
["Mobile workstation",null,1,null,2130,1471,1409.26,1580,1470,1083.06,1933.65,null,"CHK Totale",{"$f":"+IF(AND(N16=1,N17=1,N18=1),1,0)","v":1},{"$f":"+IF(AND(O16=1,O17=1,O18=1),1,0)","v":0},1,1,1,1,1]
["Upgrade RAM installata a 32 GB",{"$f":"+Input!D8","v":16},{"$f":"+IF(LEFT(B20,2)=\"32\",1,0)","v":0},null,145,79,91.06,76,75.97,72,59.26,null,"Prezzo",{"$f":"IF(N19=0,\"\",SUMPRODUCT($C$19:$C$30,E19:E30))","v":2130},{"$f":"IF(O19=0,\"\",SUMPRODUCT($C$19:$C$30,F19:F30))","v":""},{"$f":"IF(P19=0,\"\",SUMPRODUCT($C$19:$C$30,G19:G30))","v":1409.26},1580,1470,1083.06,{"$f":"IF(T19=0,\"\",SUMPRODUCT($C$19:$C$30,K19:K30))","v":1933.65}]
["Upgrade RAM installata a 64 GB",{"$f":"+Input!D8","v":16},{"$f":"+IF(LEFT(B21,2)=\"64\",1,0)","v":0},null,350,255,182.12,244,246.38,145,156.61000000000001]
["Upgrade spazio disco (storage interno) a 1TB",{"$f":"+Input!D9","v":512},{"$f":"+IF(B22=\"1.000 *\",1,0)","v":0},null,76,52,78.05,49,47.69,63.5,68.78,null,null,"Graduatoria","Prezzo","Fornitore aggiudicatario","Nome prodotto"]
["Upgrade spazio disco (storage interno) a 2TB",{"$f":"+Input!D9","v":512},{"$f":"+IF(B23=\"2.000 *\",1,0)","v":0},null,190,189,183.65,190,189,159,174.6,null,null,1,{"$f":"IFERROR(SMALL($N$20:$T$20,N23),\"\")","v":1083.06},{"$f":"IF(O23=\"\",\"\",INDEX(_xlfn._xlws.FILTER($N$1:$T$1,$N$20:$T$20=O23),COUNTIF(N20:$T$20, O23)))","v":"Posdata S.r.l."},{"$f":"IF(O23=\"\",\"\",HLOOKUP(P23,$E$33:$K$34,2,FALSE))","v":"Lenovo ThinkPad P16v Gen2 "}]
[{"$f":"+Input!C11","v":"Scheda grafica discreta"},{"$f":"+Input!D11","v":"No"},{"$f":"+IF(LEFT(B24,2)=\"Sì\",1,0)","v":0},null,350,142,136.59,137,137.56,144.33000000000001,328.04,null,null,2,1409.26,{"$f":"IF(O24=\"\",\"\",INDEX(_xlfn._xlws.FILTER($N$1:$T$1,$N$20:$T$20=O24),COUNTIF(N$20:$T21, O24)))","v":"Converge S.r.l."},{"$f":"IF(O24=\"\",\"\",HLOOKUP(P24,$E$33:$K$34,2,FALSE))","v":"Lenovo ThinkPad P16v Gen2 "}]
[{"$f":"+Input!C10","v":"Sistema Operativo"},{"$f":"+Input!D10","v":"Distribuzione Linux"},{"$f":"+IF(LEFT(B25,2)=\"Wi\",1,0)","v":0},null,150,130,120.63,124,125.32,106,126.98,null,null,3,1470,{"$f":"IF(O25=\"\",\"\",INDEX(_xlfn._xlws.FILTER($N$1:$T$1,$N$20:$T$20=O25),COUNTIF(N$20:$T22, O25)))","v":"ITM S.r.l."},{"$f":"IF(O25=\"\",\"\",HLOOKUP(P25,$E$33:$K$34,2,FALSE))","v":"Dell Pro Max 16"}]
[{"$f":"+Input!C25","v":"Docking station / port-replicator"},{"$f":"+Input!D25","v":"No"},{"$f":"+IF(LEFT(B26,2)=\"Sì\",1,0)","v":0},null,200,123,199.01,150,117.78,190,191.01,null,null,4,1580,{"$f":"IF(O26=\"\",\"\",INDEX(_xlfn._xlws.FILTER($N$1:$T$1,$N$20:$T$20=O26),COUNTIF(N$20:$T23, O26)))","v":"Eurome S.r.l."},"Dell Pro Max 16"]
[{"$f":"+Input!C26","v":"Set tastiera e mouse wireless"},{"$f":"+Input!D26","v":"No"},{"$f":"+IF(LEFT(B27,2)=\"Sì\",1,0)","v":0},null,45,36,27.75,25,20.53,25.5,39.47,null,null,5,1933.65,{"$f":"IF(O27=\"\",\"\",INDEX(_xlfn._xlws.FILTER($N$1:$T$1,$N$20:$T$20=O27),COUNTIF(N$20:$T24, O27)))","v":"RTI Trust Technology Services  S.r.l."},"HP ZBook Fury 16 G11"]
[{"$f":"+Input!C27","v":"Cuffie stereo e microfono"},{"$f":"+Input!D27","v":"No"},0,null,25,42,18.29,43,39.01,35,19.23,null,null,6,2130,{"$f":"IF(O28=\"\",\"\",INDEX(_xlfn._xlws.FILTER($N$1:$T$1,$N$20:$T$20=O28),COUNTIF(N$20:$T25, O28)))","v":"Bellucci S.p.A."},"HP ZBook Fury 16 G11"]
[{"$f":"+Input!C28","v":"Zaino porta computer"},{"$f":"+Input!D28","v":"No"},0,null,18,20,20.81,18,12.32,20,12.03,null,null,7,"",{"$f":"IF(O29=\"\",\"\",INDEX(_xlfn._xlws.FILTER($N$1:$T$1,$N$20:$T$20=O29),COUNTIF(N$20:$T26, O29)))","v":""},""]
[{"$f":"+Input!C29","v":"Monitor multimediale da 27''"},{"$f":"+Input!D29","v":"No"},0,null,240,279,200.72,200,199,180,148.35,null,null,null,"",{"$f":"IF(O30=\"\",\"\",_xlfn.XLOOKUP(O30,$N$20:$T$20,$N$1:$T$1,,,1))","v":""},{"$f":"IF(O30=\"\",\"\",HLOOKUP(P30,E8:K40,33,FALSE))","v":""}]
{"$rows_left_out":5}
{"sheet":"Congelam_PC","index":5,"n_rows":9,"n_cols":5,"rows_kept":9,"cut":false,"hidden":true,"merged":[]}
[]
[null,"OE","Congelamento",null,"Selezionare 1 SOLO per i prodotti momentanemaente congelati."]
[null,"Bellucci S.p.A.",null,null,"Tali prodotti non compariranno negli fogli di output OdA e AS."]
[null,"Bsistemi S.p.A.",1]
[null,"Converge S.r.l."]
[null,"Eurome S.r.l."]
[null,"ITM S.r.l."]
[null,"Posdata S.r.l."]
[null,"RTI Trust Technology Services  S.r.l."]

{"sheet":"Config_Dispo","index":6,"n_rows":255,"n_cols":9,"rows_kept":255,"cut":false,"hidden":true,"merged":[]}
["Selezione",{"$f":"D1&E1&F1&G1&H1","v":"16512SìNoDistribuzione Linux"},null,{"$f":"LEFT(Input!D8,2)","v":"16"},{"$f":"VLOOKUP(Input!D9,Ana!B2:C4,2,FALSE)","v":512},{"$f":"+IF(G1=\"No\",\"Sì\",\"No\")","v":"Sì"},{"$f":"LEFT(Input!D11,2)","v":"No"},{"$f":"VLOOKUP(Input!D10,Ana!$D$2:$E$3,2,FALSE)","v":"Distribuzione Linux"}]
[]
[null,"Concatena","OE","RAM (GB)","SSD (GB)","Scheda Grafica base","Upgrade\nScheda grafica","Sistema Operativo","Config dispo"]
[null,{"$f":"C4&D4&E4&F4&G4&H4","v":"Bellucci S.p.A.16512SìNoDistribuzione Linux"},"Bellucci S.p.A.",16,512,"Sì","No","Distribuzione Linux",{"$f":"+IF(H4=\"NO\",0,1)","v":1}]
[null,{"$f":"C5&D5&E5&F5&G5&H5","v":"Bellucci S.p.A.16512SìNoWindows 11 Pro"},"Bellucci S.p.A.",16,512,"Sì","No","Windows 11 Pro",{"$f":"+IF(H5=\"NO\",0,1)","v":1}]
[null,"Bellucci S.p.A.16512NoSìDistribuzione Linux","Bellucci S.p.A.",16,512,"No","Sì","Distribuzione Linux",1]
[null,"Bellucci S.p.A.16512NoSìWindows 11 Pro","Bellucci S.p.A.",16,512,"No","Sì","Windows 11 Pro",1]
[null,"Bellucci S.p.A.161000SìNoDistribuzione Linux","Bellucci S.p.A.",16,1000,"Sì","No","Distribuzione Linux",1]
[null,"Bellucci S.p.A.161000SìNoWindows 11 Pro","Bellucci S.p.A.",16,1000,"Sì","No","Windows 11 Pro",1]
[null,"Bellucci S.p.A.161000NoSìDistribuzione Linux","Bellucci S.p.A.",16,1000,"No","Sì","Distribuzione Linux",1]
[null,"Bellucci S.p.A.161000NoSìWindows 11 Pro","Bellucci S.p.A.",16,1000,"No","Sì","Windows 11 Pro",1]
[null,"Bellucci S.p.A.162000SìNoDistribuzione Linux","Bellucci S.p.A.",16,2000,"Sì","No","Distribuzione Linux",1]
[null,"Bellucci S.p.A.162000SìNoWindows 11 Pro","Bellucci S.p.A.",16,2000,"Sì","No","Windows 11 Pro",1]
[null,"Bellucci S.p.A.162000NoSìDistribuzione Linux","Bellucci S.p.A.",16,2000,"No","Sì","Distribuzione Linux",1]
[null,"Bellucci S.p.A.162000NoSìWindows 11 Pro","Bellucci S.p.A.",16,2000,"No","Sì","Windows 11 Pro",1]
[null,"Bellucci S.p.A.32512SìNoDistribuzione Linux","Bellucci S.p.A.",32,512,"Sì","No","Distribuzione Linux",1]
[null,"Bellucci S.p.A.32512SìNoWindows 11 Pro","Bellucci S.p.A.",32,512,"Sì","No","Windows 11 Pro",1]
[null,"Bellucci S.p.A.32512NoSìDistribuzione Linux","Bellucci S.p.A.",32,512,"No","Sì","Distribuzione Linux",1]
[null,"Bellucci S.p.A.32512NoSìWindows 11 Pro","Bellucci S.p.A.",32,512,"No","Sì","Windows 11 Pro",1]
[null,"Bellucci S.p.A.321000SìNoDistribuzione Linux","Bellucci S.p.A.",32,1000,"Sì","No","Distribuzione Linux",1]
[null,"Bellucci S.p.A.321000SìNoWindows 11 Pro","Bellucci S.p.A.",32,1000,"Sì","No","Windows 11 Pro",1]
[null,"Bellucci S.p.A.321000NoSìDistribuzione Linux","Bellucci S.p.A.",32,1000,"No","Sì","Distribuzione Linux",1]
[null,"Bellucci S.p.A.321000NoSìWindows 11 Pro","Bellucci S.p.A.",32,1000,"No","Sì","Windows 11 Pro",1]
[null,"Bellucci S.p.A.322000SìNoDistribuzione Linux","Bellucci S.p.A.",32,2000,"Sì","No","Distribuzione Linux",1]
[null,"Bellucci S.p.A.322000SìNoWindows 11 Pro","Bellucci S.p.A.",32,2000,"Sì","No","Windows 11 Pro",1]
[null,"Bellucci S.p.A.322000NoSìDistribuzione Linux","Bellucci S.p.A.",32,2000,"No","Sì","Distribuzione Linux",1]
[null,"Bellucci S.p.A.322000NoSìWindows 11 Pro","Bellucci S.p.A.",32,2000,"No","Sì","Windows 11 Pro",1]
[null,"Bellucci S.p.A.64512SìNoDistribuzione Linux","Bellucci S.p.A.",64,512,"Sì","No","Distribuzione Linux",1]
[null,"Bellucci S.p.A.64512SìNoWindows 11 Pro","Bellucci S.p.A.",64,512,"Sì","No","Windows 11 Pro",1]
[null,"Bellucci S.p.A.64512NoSìDistribuzione Linux","Bellucci S.p.A.",64,512,"No","Sì","Distribuzione Linux",1]
{"$rows_left_out":226}
{"sheet":"Contatti_Fornitori","index":7,"n_rows":9,"n_cols":5,"rows_kept":9,"cut":false,"hidden":true,"merged":[]}
[]
[null,"OE","Nome e Cognome","e-mail","Tel"]
[null,"Bellucci S.p.A.","Roberto Santarelli","rsantarelli@gruppobellucci.it"]
[null,"Bsistemi S.p.A.","Stefania Scappaticci"," s.scappaticci@bsistemi.com"]
[null,"Converge S.r.l.","Massimo Tosti","m.tosti@converge.it"]
[null,"Eurome S.r.l.","Giorgio Marinelli","gestioneAQ@eurome.it"]
[null,"ITM S.r.l.","Giuseppina Mazza","mazzap@itmnet.it"]
[null,"Posdata S.r.l.","Andrea Calibani","andrea.calibani@posdata.it"]
[null,"RTI Trust Technology Services  S.r.l.","Nicola Belloni","ufficiogare@tt-services.it"]

{"sheet":"Ana","index":8,"n_rows":16,"n_cols":21,"rows_kept":16,"cut":false,"hidden":true,"merged":[]}
["RAM","SSD",null,"Sist_Operat",null,"Sì/No","Sì/No/StessoProd","Monitor","Num","Scheda_Graf","Display","EspRAM","EspSSD",null,"Monitor",null,"Tendine","Valori",null,"Bellucci","Bellucci S.p.A."]
[16,512,512,"Distribuzione Linux","Distribuzione Linux","No","No",15.6,2,"Integrata","HD",16,512,null,"No",null,8,8,null,"Bsistemi","Bsistemi S.p.A."]
["32 *","1.000 *",1000,"Windows 11 Pro *","Windows 11 Pro","Sì *","Sì *",16,3,"Discreta *","FHD *",32,1024,null,"Sì, da 23.6” *",null,"16 *",16,null,"Converge","Converge S.r.l."]
["64 *","2.000 *",2000,null,null,null,"Sì, dello stesso produttore del PC *",null,4,null,null,64,null,null,"Sì, da 27” *",null,"Low","Low",null,"Eurome","Eurome S.r.l."]
[null,null,null,null,null,null,null,null,5,null,null,128,null,null,"Sì, da 23.6” dello stesso produttore del PC *",null,"Mid *","Mid",null,"ITM informatica","Informatica Telematica Meridionale S.r.l."]
[null,null,null,null,null,null,null,null,null,null,null,null,null,null,"Sì, da 27” dello stesso produttore del PC *",null,"High *","High",null,"Posdata","Posdata S.r.l."]
[null,null,null,null,null,null,null,null,null,null,null,null,null,null,null,null,256,256,null,"RTI Trust","RTI Trust Italia S.r.l."]
[null,null,null,null,null,null,null,null,null,null,null,null,null,null,null,null,"512 *",512]
[null,null,null,null,null,null,null,null,null,null,null,null,null,null,null,null,"Distribuzione Linux","Distribuzione Linux"]
[null,null,null,null,null,null,null,null,null,null,null,null,null,null,null,null,"Windows 11 Pro *","Windows 11 Pro"]
[null,null,null,null,null,null,null,null,null,null,null,null,null,null,null,null,"Windows 11 Pro Education *","Windows 11 Pro Education"]
[null,null,null,null,null,null,null,null,null,null,null,null,null,null,null,null,"HD","HD"]
[null,null,null,null,null,null,null,null,null,null,null,null,null,null,null,null,"FHD *","FHD"]
[null,null,null,null,null,null,null,null,null,null,null,null,null,null,null,null,"Nessuna certificazione","NO"]
[null,null,null,null,null,null,null,null,null,null,null,null,null,null,null,null,"Etichetta ISO di tipo I (UNI EN ISO 14024)","NO"]
[null,null,null,null,null,null,null,null,null,null,null,null,null,null,null,null,"Certificazione TCO","SI"]